{"text_format":"1","workbook":"xlsx","n_sheets":5,"sheets":["London","Rio","Sheet1","TOP 50 Ranking Shift","OVERALL"],"not_rendered":{"charts":2,"images":19,"macros":1,"external_links":0,"defined_names":12,"comments":0,"pivot_tables":3},"unopened":[],"bounds":{"document_bytes":16777216,"sheet_cells":100000,"rows_first":2000,"rows_last":500,"rows_between":2000,"halvings":0,"cell_chars":16384,"cell_head_chars":4096},"cells_cut":0,"cells_raw":0,"read":"whole","date_system":"1900"}

{"sheet":"London","index":0,"n_rows":94,"n_cols":16,"rows_kept":94,"cut":false,"hidden":false,"merged":[]}
["First Row",{"$f":"ROW(London[#Headers])","v":9}]
["Scrolling Link",0]
["Countries",{"$f":"COUNTA(London[Country])","v":85}]
["No of Golds",{"$f":"SUM(London[Gold])","v":301}]
["No of Silver",{"$f":"SUM(London[Silver])","v":302}]
["No of Bronze",{"$f":"SUM(London[Bronze])","v":354}]
["No of Overall",{"$f":"SUM(London[Overall])","v":957}]
[null,null,null,null,null,null,null,null,null,null,{"$f":"SMALL(IF(NOT($J9=London[[#Headers],[Gold]:[Overall]]),COLUMN(London[[#Headers],[Gold]:[Overall]])),COLUMNS($K8:K8))","v":2},{"$f":"SMALL(IF(NOT($J9=London[[#Headers],[Gold]:[Overall]]),COLUMN(London[[#Headers],[Gold]:[Overall]])),COLUMNS($K8:L8))","v":3},{"$f":"SMALL(IF(NOT($J9=London[[#Headers],[Gold]:[Overall]]),COLUMN(London[[#Headers],[Gold]:[Overall]])),COLUMNS($K8:M8))","v":4},null,"Sorting Order","Medal"]
["Country","Gold","Silver","Bronze","Overall",null,null,null,"Countries",{"$f":"London.medal","v":"Overall"},{"$f":"INDEX(London[#Headers],K8)","v":"Gold"},{"$f":"INDEX(London[#Headers],L8)","v":"Silver"},{"$f":"INDEX(London[#Headers],M8)","v":"Bronze"},null,null,"Overall"]
["United States",46,28,29,103,null,null,null,{"$f":"INDEX(London[Country],LARGE(IF(J10=OFFSET(London[[#Headers],[Country]],1,MATCH($P$9,London[#Headers],0)-1,COUNT(London[Gold])),ROW(OFFSET(London[[#Headers],[Country]],1,MATCH($P$9,London[#Headers],0)-1,COUNT(London[Gold])))-london.startrow,0),COUNTIF($J$10:J10,J10)))","v":"United States"},{"$f":"LARGE(OFFSET(London[[#Headers],[Country]],1,MATCH($P$9,London[#Headers],0)-1,COUNT(London[Gold])),ROW(I10)-london.startrow)","v":103},{"$f":"VLOOKUP($I10,London[],K$8,0)","v":46},{"$f":"VLOOKUP($I10,London[],L$8,0)","v":28},{"$f":"VLOOKUP($I10,London[],M$8,0)","v":29}]
["China",38,29,21,88,null,null,null,{"$f":"INDEX(London[Country],LARGE(IF(J11=OFFSET(London[[#Headers],[Country]],1,MATCH($P$9,London[#Headers],0)-1,COUNT(London[Gold])),ROW(OFFSET(London[[#Headers],[Country]],1,MATCH($P$9,London[#Headers],0)-1,COUNT(London[Gold])))-london.startrow,0),COUNTIF($J$10:J11,J11)))","v":"China"},{"$f":"LARGE(OFFSET(London[[#Headers],[Country]],1,MATCH($P$9,London[#Headers],0)-1,COUNT(London[Gold])),ROW(I11)-london.startrow)","v":88},{"$f":"VLOOKUP($I11,London[],K$8,0)","v":38},{"$f":"VLOOKUP($I11,London[],L$8,0)","v":29},{"$f":"VLOOKUP($I11,London[],M$8,0)","v":21}]
["Great Britain",29,17,19,65,null,null,null,{"$f":"INDEX(London[Country],LARGE(IF(J12=OFFSET(London[[#Headers],[Country]],1,MATCH($P$9,London[#Headers],0)-1,COUNT(London[Gold])),ROW(OFFSET(London[[#Headers],[Country]],1,MATCH($P$9,London[#Headers],0)-1,COUNT(London[Gold])))-london.startrow,0),COUNTIF($J$10:J12,J12)))","v":"Russia"},{"$f":"LARGE(OFFSET(London[[#Headers],[Country]],1,MATCH($P$9,London[#Headers],0)-1,COUNT(London[Gold])),ROW(I12)-london.startrow)","v":77},{"$f":"VLOOKUP($I12,London[],K$8,0)","v":22},{"$f":"VLOOKUP($I12,London[],L$8,0)","v":23},{"$f":"VLOOKUP($I12,London[],M$8,0)","v":32}]
["Russia",22,23,32,77,null,null,null,{"$f":"INDEX(London[Country],LARGE(IF(J13=OFFSET(London[[#Headers],[Country]],1,MATCH($P$9,London[#Headers],0)-1,COUNT(London[Gold])),ROW(OFFSET(London[[#Headers],[Country]],1,MATCH($P$9,London[#Headers],0)-1,COUNT(London[Gold])))-london.startrow,0),COUNTIF($J$10:J13,J13)))","v":"Great Britain"},{"$f":"LARGE(OFFSET(London[[#Headers],[Country]],1,MATCH($P$9,London[#Headers],0)-1,COUNT(London[Gold])),ROW(I13)-london.startrow)","v":65},{"$f":"VLOOKUP($I13,London[],K$8,0)","v":29},{"$f":"VLOOKUP($I13,London[],L$8,0)","v":17},{"$f":"VLOOKUP($I13,London[],M$8,0)","v":19}]
["South Korea",13,8,7,28,null,null,null,{"$f":"INDEX(London[Country],LARGE(IF(J14=OFFSET(London[[#Headers],[Country]],1,MATCH($P$9,London[#Headers],0)-1,COUNT(London[Gold])),ROW(OFFSET(London[[#Headers],[Country]],1,MATCH($P$9,London[#Headers],0)-1,COUNT(London[Gold])))-london.startrow,0),COUNTIF($J$10:J14,J14)))","v":"Germany"},{"$f":"LARGE(OFFSET(London[[#Headers],[Country]],1,MATCH($P$9,London[#Headers],0)-1,COUNT(London[Gold])),ROW(I14)-london.startrow)","v":44},{"$f":"VLOOKUP($I14,London[],K$8,0)","v":11},{"$f":"VLOOKUP($I14,London[],L$8,0)","v":19},{"$f":"VLOOKUP($I14,London[],M$8,0)","v":14}]
["Germany",11,19,14,44,null,null,null,{"$f":"INDEX(London[Country],LARGE(IF(J15=OFFSET(London[[#Headers],[Country]],1,MATCH($P$9,London[#Headers],0)-1,COUNT(London[Gold])),ROW(OFFSET(London[[#Headers],[Country]],1,MATCH($P$9,London[#Headers],0)-1,COUNT(London[Gold])))-london.startrow,0),COUNTIF($J$10:J15,J15)))","v":"Japan"},{"$f":"LARGE(OFFSET(London[[#Headers],[Country]],1,MATCH($P$9,London[#Headers],0)-1,COUNT(London[Gold])),ROW(I15)-london.startrow)","v":38},{"$f":"VLOOKUP($I15,London[],K$8,0)","v":7},{"$f":"VLOOKUP($I15,London[],L$8,0)","v":14},{"$f":"VLOOKUP($I15,London[],M$8,0)","v":17}]
{"$rows_left_out":80}
{"sheet":"Rio","index":1,"n_rows":160,"n_cols":42,"rows_kept":160,"cut":false,"hidden":false,"merged":[]}
["First Row",{"$f":"ROW(Rio[#Headers])","v":10}]
["Scrolling Link",0]
["Countries",{"$f":"COUNTA(Rio[Country])","v":88}]
["No of Golds",{"$f":"SUM(Rio[Gold])","v":307}]
["No of Silver",{"$f":"SUM(Rio[Silver])","v":307}]
["No of Bronze",{"$f":"SUM(Rio[Bronze])","v":361}]
["No of Overall",{"$f":"SUM(Rio[Overall])","v":975}]
["Comparision Country Selection","Denmark"]
[null,null,null,null,null,null,null,null,null,null,{"$f":"SMALL(IF(NOT($J10=Rio[[#Headers],[Gold]:[Overall]]),COLUMN(Rio[[#Headers],[Gold]:[Overall]])),COLUMNS($K9:K9))","v":2},{"$f":"SMALL(IF(NOT($J10=Rio[[#Headers],[Gold]:[Overall]]),COLUMN(Rio[[#Headers],[Gold]:[Overall]])),COLUMNS($K9:L9))","v":3},{"$f":"SMALL(IF(NOT($J10=Rio[[#Headers],[Gold]:[Overall]]),COLUMN(Rio[[#Headers],[Gold]:[Overall]])),COLUMNS($K9:M9))","v":4},null,"Sorting Order","Medal",null,"Row Labels",null,"Comparison Calculations RIO",null,null,"Comparison Calculations LONDON"]
["Country","Gold","Silver","Bronze","Overall",null,null,null,"Countries",{"$f":"Rio.medal","v":"Overall"},{"$f":"INDEX(Rio[#Headers],K9)","v":"Gold"},{"$f":"INDEX(Rio[#Headers],L9)","v":"Silver"},{"$f":"INDEX(Rio[#Headers],M9)","v":"Bronze"},null,null,"Overall",null,"Overall",null,"Country",{"$f":"Comparison.medal","v":"Overall"},null,"Rio's Rank in London","Country",{"$f":"Comparison.medal","v":"Overall"},null,null,"Count","Ranking Dummy",null,"Common X Axis","Y Axis for Connectors",null,"Dummy for Values not found",null,"Y Axis Back Up Calc",null,"Highlighted Country","Highlight Dummy 1","Highlight Dummy 2"]
["United States",46,37,38,{"$f":"SUM(B11:D11)","v":121},null,null,null,{"$f":"INDEX(Rio[Country],LARGE(IF(J11=OFFSET(Rio[[#Headers],[Country]],1,MATCH(Rio.medal,Rio[#Headers],0)-1,COUNT(Rio[Gold])),ROW(OFFSET(Rio[[#Headers],[Country]],1,MATCH(Rio.medal,Rio[#Headers],0)-1,COUNT(Rio[Gold])))-Rio.startrow,0),COUNTIF(J$11:$J11,J11)))","v":"United States"},{"$f":"LARGE(OFFSET(Rio[[#Headers],[Country]],1,MATCH(Rio.medal,Rio[#Headers],0)-1,COUNT(Rio[Gold])),ROW(I11)-Rio.startrow)","v":121},{"$f":"VLOOKUP($I11,Rio[],K$9,0)","v":46},{"$f":"VLOOKUP($I11,Rio[],L$9,0)","v":37},{"$f":"VLOOKUP($I11,Rio[],M$9,0)","v":38},null,null,null,null,null,null,{"$f":"INDEX(Rio[Country],LARGE(IF(U11=OFFSET(Rio[[#Headers],[Country]],1,MATCH(Comparison.medal,Rio[#Headers],0)-1,COUNT(Rio[Gold])),ROW(OFFSET(Rio[[#Headers],[Country]],1,MATCH(Comparison.medal,Rio[#Headers],0)-1,COUNT(Rio[Gold])))-Rio.startrow,0),COUNTIF($U$11:U11,U11)))","v":"United States"},{"$f":"LARGE(OFFSET(Rio[[#Headers],[Country]],1,MATCH(Comparison.medal,Rio[#Headers],0)-1,COUNT(Rio[Gold])),ROW(S11)-Rio.startrow)","v":121},null,{"$f":"MATCH(T11,$X$11:$X$61,0)","v":1},{"$f":"INDEX(London[Country],LARGE(IF(Y11=OFFSET(London[[#Headers],[Country]],1,MATCH(Comparison.medal,London[#Headers],0)-1,COUNT(London[Gold])),ROW(OFFSET(London[[#Headers],[Country]],1,MATCH(Comparison.medal,London[#Headers],0)-1,COUNT(London[Gold])))-london.startrow,0),COUNTIF($Y$11:Y11,Y11)))","v":"United States"},{"$f":"LARGE(OFFSET(London[[#Headers],[Country]],1,MATCH(Comparison.medal,London[#Headers],0)-1,COUNT(London[Gold])),ROW(U11)-Rio.startrow)","v":103},null,null,1,{"$f":"IFERROR(IF(AP11,CEILING(ROWS(AC$11:$AC11),3)/3,CEILING(ROWS(AC$11:$AC11),3)/3),NA())","v":1},null,1,{"$f":"IF(AH11,AJ11,-1)","v":-1},null,{"$f":"NOT(AND(AP11<>\"\",ISERROR(INDEX($W$11:$W$60,AC11))))","v":true},null,{"$f":"-IFERROR(IF(AP11,CEILING(ROWS(AJ$11:$AJ11),3)/3,IFERROR(INDEX($W$11:$W$60,ABS(AJ10)),1)),0)","v":-1},null,{"$f":"IF(AN11,IF(AH11=FALSE,1,AF11),NA())","v":{"$error":"#N/A"}},{"$f":"OR(AM10,AND(-MATCH(Overall.country,$T$11:$T$60,0)=AJ11,AP11))","v":false},{"$f":"OR(AM11,AM10)","v":false},null,{"$f":"IF(MOD(AB11,3)=0,\"\",IF(AP10=\"\",TRUE,FALSE))","v":true}]
["Great Britain",27,23,17,67,null,null,null,{"$f":"INDEX(Rio[Country],LARGE(IF(J12=OFFSET(Rio[[#Headers],[Country]],1,MATCH(Rio.medal,Rio[#Headers],0)-1,COUNT(Rio[Gold])),ROW(OFFSET(Rio[[#Headers],[Country]],1,MATCH(Rio.medal,Rio[#Headers],0)-1,COUNT(Rio[Gold])))-Rio.startrow,0),COUNTIF(J$11:$J12,J12)))","v":"China"},{"$f":"LARGE(OFFSET(Rio[[#Headers],[Country]],1,MATCH(Rio.medal,Rio[#Headers],0)-1,COUNT(Rio[Gold])),ROW(I12)-Rio.startrow)","v":70},{"$f":"VLOOKUP($I12,Rio[],K$9,0)","v":26},{"$f":"VLOOKUP($I12,Rio[],L$9,0)","v":18},{"$f":"VLOOKUP($I12,Rio[],M$9,0)","v":26},null,null,null,null,null,null,{"$f":"INDEX(Rio[Country],LARGE(IF(U12=OFFSET(Rio[[#Headers],[Country]],1,MATCH(Comparison.medal,Rio[#Headers],0)-1,COUNT(Rio[Gold])),ROW(OFFSET(Rio[[#Headers],[Country]],1,MATCH(Comparison.medal,Rio[#Headers],0)-1,COUNT(Rio[Gold])))-Rio.startrow,0),COUNTIF($U$11:U12,U12)))","v":"China"},{"$f":"LARGE(OFFSET(Rio[[#Headers],[Country]],1,MATCH(Comparison.medal,Rio[#Headers],0)-1,COUNT(Rio[Gold])),ROW(S12)-Rio.startrow)","v":70},null,{"$f":"MATCH(T12,$X$11:$X$61,0)","v":2},{"$f":"INDEX(London[Country],LARGE(IF(Y12=OFFSET(London[[#Headers],[Country]],1,MATCH(Comparison.medal,London[#Headers],0)-1,COUNT(London[Gold])),ROW(OFFSET(London[[#Headers],[Country]],1,MATCH(Comparison.medal,London[#Headers],0)-1,COUNT(London[Gold])))-london.startrow,0),COUNTIF($Y$11:Y12,Y12)))","v":"China"},{"$f":"LARGE(OFFSET(London[[#Headers],[Country]],1,MATCH(Comparison.medal,London[#Headers],0)-1,COUNT(London[Gold])),ROW(U12)-Rio.startrow)","v":88},null,null,{"$f":"AB11+1","v":2},{"$f":"IFERROR(IF(AP12,CEILING(ROWS(AC$11:$AC12),3)/3,CEILING(ROWS(AC$11:$AC12),3)/3),NA())","v":1},null,10,-1,null,true,null,{"$f":"-IFERROR(IF(AP12,CEILING(ROWS(AJ$11:$AJ12),3)/3,IFERROR(INDEX($W$11:$W$60,ABS(AJ11)),1)),0)","v":-1},null,{"$error":"#N/A"},{"$f":"AND(-MATCH(Overall.country,$T$11:$T$60,0)=AJ12,AP12)","v":false},false,null,false]
["China",26,18,26,70,null,null,null,{"$f":"INDEX(Rio[Country],LARGE(IF(J13=OFFSET(Rio[[#Headers],[Country]],1,MATCH(Rio.medal,Rio[#Headers],0)-1,COUNT(Rio[Gold])),ROW(OFFSET(Rio[[#Headers],[Country]],1,MATCH(Rio.medal,Rio[#Headers],0)-1,COUNT(Rio[Gold])))-Rio.startrow,0),COUNTIF(J$11:$J13,J13)))","v":"Great Britain"},{"$f":"LARGE(OFFSET(Rio[[#Headers],[Country]],1,MATCH(Rio.medal,Rio[#Headers],0)-1,COUNT(Rio[Gold])),ROW(I13)-Rio.startrow)","v":67},{"$f":"VLOOKUP($I13,Rio[],K$9,0)","v":27},{"$f":"VLOOKUP($I13,Rio[],L$9,0)","v":23},{"$f":"VLOOKUP($I13,Rio[],M$9,0)","v":17},null,null,null,null,null,null,{"$f":"INDEX(Rio[Country],LARGE(IF(U13=OFFSET(Rio[[#Headers],[Country]],1,MATCH(Comparison.medal,Rio[#Headers],0)-1,COUNT(Rio[Gold])),ROW(OFFSET(Rio[[#Headers],[Country]],1,MATCH(Comparison.medal,Rio[#Headers],0)-1,COUNT(Rio[Gold])))-Rio.startrow,0),COUNTIF($U$11:U13,U13)))","v":"Great Britain"},{"$f":"LARGE(OFFSET(Rio[[#Headers],[Country]],1,MATCH(Comparison.medal,Rio[#Headers],0)-1,COUNT(Rio[Gold])),ROW(S13)-Rio.startrow)","v":67},null,4,{"$f":"INDEX(London[Country],LARGE(IF(Y13=OFFSET(London[[#Headers],[Country]],1,MATCH(Comparison.medal,London[#Headers],0)-1,COUNT(London[Gold])),ROW(OFFSET(London[[#Headers],[Country]],1,MATCH(Comparison.medal,London[#Headers],0)-1,COUNT(London[Gold])))-london.startrow,0),COUNTIF($Y$11:Y13,Y13)))","v":"Russia"},{"$f":"LARGE(OFFSET(London[[#Headers],[Country]],1,MATCH(Comparison.medal,London[#Headers],0)-1,COUNT(London[Gold])),ROW(U13)-Rio.startrow)","v":77},null,null,3,{"$f":"IFERROR(IF(AP13,CEILING(ROWS(AC$11:$AC13),3)/3,CEILING(ROWS(AC$11:$AC13),3)/3),NA())","v":{"$error":"#N/A"}},null,null,0,null,true,null,{"$f":"-IFERROR(IF(AP13,CEILING(ROWS(AJ$11:$AJ13),3)/3,IFERROR(INDEX($W$11:$W$60,ABS(AJ12)),1)),0)","v":0},null,{"$error":"#N/A"},false,false,null,""]
["Russia",19,18,19,56,null,null,null,{"$f":"INDEX(Rio[Country],LARGE(IF(J14=OFFSET(Rio[[#Headers],[Country]],1,MATCH(Rio.medal,Rio[#Headers],0)-1,COUNT(Rio[Gold])),ROW(OFFSET(Rio[[#Headers],[Country]],1,MATCH(Rio.medal,Rio[#Headers],0)-1,COUNT(Rio[Gold])))-Rio.startrow,0),COUNTIF(J$11:$J14,J14)))","v":"Russia"},{"$f":"LARGE(OFFSET(Rio[[#Headers],[Country]],1,MATCH(Rio.medal,Rio[#Headers],0)-1,COUNT(Rio[Gold])),ROW(I14)-Rio.startrow)","v":56},{"$f":"VLOOKUP($I14,Rio[],K$9,0)","v":19},{"$f":"VLOOKUP($I14,Rio[],L$9,0)","v":18},{"$f":"VLOOKUP($I14,Rio[],M$9,0)","v":19},null,null,null,null,null,null,{"$f":"INDEX(Rio[Country],LARGE(IF(U14=OFFSET(Rio[[#Headers],[Country]],1,MATCH(Comparison.medal,Rio[#Headers],0)-1,COUNT(Rio[Gold])),ROW(OFFSET(Rio[[#Headers],[Country]],1,MATCH(Comparison.medal,Rio[#Headers],0)-1,COUNT(Rio[Gold])))-Rio.startrow,0),COUNTIF($U$11:U14,U14)))","v":"Russia"},{"$f":"LARGE(OFFSET(Rio[[#Headers],[Country]],1,MATCH(Comparison.medal,Rio[#Headers],0)-1,COUNT(Rio[Gold])),ROW(S14)-Rio.startrow)","v":56},null,3,{"$f":"INDEX(London[Country],LARGE(IF(Y14=OFFSET(London[[#Headers],[Country]],1,MATCH(Comparison.medal,London[#Headers],0)-1,COUNT(London[Gold])),ROW(OFFSET(London[[#Headers],[Country]],1,MATCH(Comparison.medal,London[#Headers],0)-1,COUNT(London[Gold])))-london.startrow,0),COUNTIF($Y$11:Y14,Y14)))","v":"Great Britain"},{"$f":"LARGE(OFFSET(London[[#Headers],[Country]],1,MATCH(Comparison.medal,London[#Headers],0)-1,COUNT(London[Gold])),ROW(U14)-Rio.startrow)","v":65},null,null,4,{"$f":"IFERROR(IF(AP14,CEILING(ROWS(AC$11:$AC14),3)/3,CEILING(ROWS(AC$11:$AC14),3)/3),NA())","v":2},null,1,-2,null,true,null,{"$f":"-IFERROR(IF(AP14,CEILING(ROWS(AJ$11:$AJ14),3)/3,IFERROR(INDEX($W$11:$W$60,ABS(AJ13)),1)),0)","v":-2},null,{"$error":"#N/A"},false,false,null,true]
["Germany",17,10,15,42,null,null,null,{"$f":"INDEX(Rio[Country],LARGE(IF(J15=OFFSET(Rio[[#Headers],[Country]],1,MATCH(Rio.medal,Rio[#Headers],0)-1,COUNT(Rio[Gold])),ROW(OFFSET(Rio[[#Headers],[Country]],1,MATCH(Rio.medal,Rio[#Headers],0)-1,COUNT(Rio[Gold])))-Rio.startrow,0),COUNTIF(J$11:$J15,J15)))","v":"France"},{"$f":"LARGE(OFFSET(Rio[[#Headers],[Country]],1,MATCH(Rio.medal,Rio[#Headers],0)-1,COUNT(Rio[Gold])),ROW(I15)-Rio.startrow)","v":42},{"$f":"VLOOKUP($I15,Rio[],K$9,0)","v":10},{"$f":"VLOOKUP($I15,Rio[],L$9,0)","v":18},{"$f":"VLOOKUP($I15,Rio[],M$9,0)","v":14},null,null,null,null,null,null,{"$f":"INDEX(Rio[Country],LARGE(IF(U15=OFFSET(Rio[[#Headers],[Country]],1,MATCH(Comparison.medal,Rio[#Headers],0)-1,COUNT(Rio[Gold])),ROW(OFFSET(Rio[[#Headers],[Country]],1,MATCH(Comparison.medal,Rio[#Headers],0)-1,COUNT(Rio[Gold])))-Rio.startrow,0),COUNTIF($U$11:U15,U15)))","v":"France"},{"$f":"LARGE(OFFSET(Rio[[#Headers],[Country]],1,MATCH(Comparison.medal,Rio[#Headers],0)-1,COUNT(Rio[Gold])),ROW(S15)-Rio.startrow)","v":42},null,8,{"$f":"INDEX(London[Country],LARGE(IF(Y15=OFFSET(London[[#Headers],[Country]],1,MATCH(Comparison.medal,London[#Headers],0)-1,COUNT(London[Gold])),ROW(OFFSET(London[[#Headers],[Country]],1,MATCH(Comparison.medal,London[#Headers],0)-1,COUNT(London[Gold])))-london.startrow,0),COUNTIF($Y$11:Y15,Y15)))","v":"Germany"},{"$f":"LARGE(OFFSET(London[[#Headers],[Country]],1,MATCH(Comparison.medal,London[#Headers],0)-1,COUNT(London[Gold])),ROW(U15)-Rio.startrow)","v":44},null,null,5,{"$f":"IFERROR(IF(AP15,CEILING(ROWS(AC$11:$AC15),3)/3,CEILING(ROWS(AC$11:$AC15),3)/3),NA())","v":2},null,10,-2,null,true,null,{"$f":"-IFERROR(IF(AP15,CEILING(ROWS(AJ$11:$AJ15),3)/3,IFERROR(INDEX($W$11:$W$60,ABS(AJ14)),1)),0)","v":-2},null,{"$error":"#N/A"},false,false,null,false]
{"$rows_left_out":146}
{"sheet":"Sheet1","index":2,"n_rows":24,"n_cols":16,"rows_kept":24,"cut":false,"hidden":false,"merged":[]}
[]
[]
[null,null,null,null,null,null,null,null,null,null,null,null,null,null,null,{"$f":"HYPERLINK(\"http://www.goodly.co.in/rio-olympics-visualization-in-excel\",\"www.goodly.co.in\")","v":"www.goodly.co.in"}]
[]
[]
[]
[]
[]
[]
[]
[]
[]
[]
[]
[]
{"$rows_left_out":10}
{"sheet":"TOP 50 Ranking Shift","index":3,"n_rows":55,"n_cols":14,"rows_kept":55,"cut":false,"hidden":false,"merged":[]}
[]
[]
[null,"RIO OLYMPICS 2016",null,null,null,null,null,null,"LONDON OLYMPICS 2012"]
[]
[null,"Rank","Country",{"$f":"Comparison.medal&\" Medals\"","v":"Overall Medals"},null,null,null,null,"Rank","Country",{"$f":"Comparison.medal&\" Medals\"","v":"Overall Medals"}]
[null,1,{"$f":"Rio!T11","v":"United States"},{"$f":"Rio!U11","v":121},null,null,null,null,1,{"$f":"Rio!X11","v":"United States"},{"$f":"Rio!Y11","v":103}]
[null,{"$f":"B6+1","v":2},{"$f":"Rio!T12","v":"China"},{"$f":"Rio!U12","v":70},null,null,null,null,{"$f":"I6+1","v":2},{"$f":"Rio!X12","v":"China"},{"$f":"Rio!Y12","v":88}]
[null,{"$f":"B7+1","v":3},{"$f":"Rio!T13","v":"Great Britain"},{"$f":"Rio!U13","v":67},"Silver","Bronze","Overall",null,{"$f":"I7+1","v":3},{"$f":"Rio!X13","v":"Russia"},{"$f":"Rio!Y13","v":77},"Silver","Bronze","Overall"]
[null,4,{"$f":"Rio!T14","v":"Russia"},{"$f":"Rio!U14","v":56},null,null,null,null,4,{"$f":"Rio!X14","v":"Great Britain"},{"$f":"Rio!Y14","v":65}]
[null,5,{"$f":"Rio!T15","v":"France"},{"$f":"Rio!U15","v":42},null,null,null,null,5,{"$f":"Rio!X15","v":"Germany"},{"$f":"Rio!Y15","v":44}]
[null,6,{"$f":"Rio!T16","v":"Germany"},{"$f":"Rio!U16","v":42},null,null,null,null,6,{"$f":"Rio!X16","v":"Japan"},{"$f":"Rio!Y16","v":38}]
[null,7,{"$f":"Rio!T17","v":"Japan"},{"$f":"Rio!U17","v":41},null,null,null,null,7,{"$f":"Rio!X17","v":"Australia"},{"$f":"Rio!Y17","v":35}]
[null,8,{"$f":"Rio!T18","v":"Australia"},{"$f":"Rio!U18","v":29},null,null,null,null,8,{"$f":"Rio!X18","v":"France"},{"$f":"Rio!Y18","v":34}]
[null,9,{"$f":"Rio!T19","v":"Italy"},{"$f":"Rio!U19","v":28},null,null,null,null,9,{"$f":"Rio!X19","v":"Italy"},{"$f":"Rio!Y19","v":28}]
[null,10,{"$f":"Rio!T20","v":"Canada"},{"$f":"Rio!U20","v":22},null,null,null,null,10,{"$f":"Rio!X20","v":"South Korea"},{"$f":"Rio!Y20","v":28}]
{"$rows_left_out":41}
{"sheet":"OVERALL","index":4,"n_rows":27,"n_cols":14,"rows_kept":27,"cut":false,"hidden":false,"merged":[]}
[]
[]
[null,"RIO OLYMPICS 2016",null,null,null,null,null,null,"LONDON OLYMPICS 2012"]
[]
[]
[]
[null,null,null,{"$f":"IF(Rio.medal=D9,\"Sorted by\",\"\")","v":""},{"$f":"IF(Rio.medal=E9,\"Sorted by\",\"\")","v":""},{"$f":"IF(Rio.medal=F9,\"Sorted by\",\"\")","v":""},{"$f":"IF(Rio.medal=G9,\"Sorted by\",\"\")","v":"Sorted by"},null,null,null,{"$f":"IF(London.medal=K9,\"Sorted by\",\"\")","v":""},{"$f":"IF(London.medal=L9,\"Sorted by\",\"\")","v":""},{"$f":"IF(London.medal=M9,\"Sorted by\",\"\")","v":""},{"$f":"IF(London.medal=N9,\"Sorted by\",\"\")","v":"Sorted by"}]
[]
[null,"Rank","Country","Gold","Silver","Bronze","Overall",null,"Rank","Country","Gold","Silver","Bronze","Overall"]
[null,{"$f":"RANK(VLOOKUP(C10,Rio!$I$11:$M$98,2,),Rio!$J$11:$J$98)","v":1},{"$f":"INDEX(Rio!$I$11:$I$98,ROWS($C$10:C10)+Rio.scroll)","v":"United States"},{"$f":"VLOOKUP($C10,Rio!$I$11:$M$98,MATCH(K$9,Rio!$I$10:$M$10,0),)","v":46},{"$f":"VLOOKUP($C10,Rio!$I$11:$M$98,MATCH(L$9,Rio!$I$10:$M$10,0),)","v":37},{"$f":"VLOOKUP($C10,Rio!$I$11:$M$98,MATCH(M$9,Rio!$I$10:$M$10,0),)","v":38},{"$f":"VLOOKUP($C10,Rio!$I$11:$M$98,MATCH(N$9,Rio!$I$10:$M$10,0),)","v":121},null,{"$f":"RANK(VLOOKUP(OVERALL!J10,London!$I$10:$M$94,2,),London!$J$10:$J$94)","v":1},{"$f":"INDEX(London!$I$10:$I$94,ROWS($J$10:J10)+london.scroll)","v":"United States"},{"$f":"VLOOKUP($J10,London!$I$10:$M$94,MATCH(D$9,London!$I$9:$M$9,0),)","v":46},{"$f":"VLOOKUP($J10,London!$I$10:$M$94,MATCH(E$9,London!$I$9:$M$9,0),)","v":28},{"$f":"VLOOKUP($J10,London!$I$10:$M$94,MATCH(F$9,London!$I$9:$M$9,0),)","v":29},{"$f":"VLOOKUP($J10,London!$I$10:$M$94,MATCH(G$9,London!$I$9:$M$9,0),)","v":103}]
[null,{"$f":"RANK(VLOOKUP(C11,Rio!$I$11:$M$98,2,),Rio!$J$11:$J$98)","v":2},{"$f":"INDEX(Rio!$I$11:$I$98,ROWS($C$10:C11)+Rio.scroll)","v":"China"},{"$f":"VLOOKUP($C11,Rio!$I$11:$M$98,MATCH(K$9,Rio!$I$10:$M$10,0),)","v":26},{"$f":"VLOOKUP($C11,Rio!$I$11:$M$98,MATCH(L$9,Rio!$I$10:$M$10,0),)","v":18},{"$f":"VLOOKUP($C11,Rio!$I$11:$M$98,MATCH(M$9,Rio!$I$10:$M$10,0),)","v":26},{"$f":"VLOOKUP($C11,Rio!$I$11:$M$98,MATCH(N$9,Rio!$I$10:$M$10,0),)","v":70},null,{"$f":"RANK(VLOOKUP(OVERALL!J11,London!$I$10:$M$94,2,),London!$J$10:$J$94)","v":2},{"$f":"INDEX(London!$I$10:$I$94,ROWS($J$10:J11)+london.scroll)","v":"China"},{"$f":"VLOOKUP($J11,London!$I$10:$M$94,MATCH(D$9,London!$I$9:$M$9,0),)","v":38},{"$f":"VLOOKUP($J11,London!$I$10:$M$94,MATCH(E$9,London!$I$9:$M$9,0),)","v":29},{"$f":"VLOOKUP($J11,London!$I$10:$M$94,MATCH(F$9,London!$I$9:$M$9,0),)","v":21},{"$f":"VLOOKUP($J11,London!$I$10:$M$94,MATCH(G$9,London!$I$9:$M$9,0),)","v":88}]
[null,{"$f":"RANK(VLOOKUP(C12,Rio!$I$11:$M$98,2,),Rio!$J$11:$J$98)","v":3},{"$f":"INDEX(Rio!$I$11:$I$98,ROWS($C$10:C12)+Rio.scroll)","v":"Great Britain"},{"$f":"VLOOKUP($C12,Rio!$I$11:$M$98,MATCH(K$9,Rio!$I$10:$M$10,0),)","v":27},{"$f":"VLOOKUP($C12,Rio!$I$11:$M$98,MATCH(L$9,Rio!$I$10:$M$10,0),)","v":23},{"$f":"VLOOKUP($C12,Rio!$I$11:$M$98,MATCH(M$9,Rio!$I$10:$M$10,0),)","v":17},{"$f":"VLOOKUP($C12,Rio!$I$11:$M$98,MATCH(N$9,Rio!$I$10:$M$10,0),)","v":67},null,{"$f":"RANK(VLOOKUP(OVERALL!J12,London!$I$10:$M$94,2,),London!$J$10:$J$94)","v":3},{"$f":"INDEX(London!$I$10:$I$94,ROWS($J$10:J12)+london.scroll)","v":"Russia"},{"$f":"VLOOKUP($J12,London!$I$10:$M$94,MATCH(D$9,London!$I$9:$M$9,0),)","v":22},{"$f":"VLOOKUP($J12,London!$I$10:$M$94,MATCH(E$9,London!$I$9:$M$9,0),)","v":23},{"$f":"VLOOKUP($J12,London!$I$10:$M$94,MATCH(F$9,London!$I$9:$M$9,0),)","v":32},{"$f":"VLOOKUP($J12,London!$I$10:$M$94,MATCH(G$9,London!$I$9:$M$9,0),)","v":77}]
[null,{"$f":"RANK(VLOOKUP(C13,Rio!$I$11:$M$98,2,),Rio!$J$11:$J$98)","v":4},{"$f":"INDEX(Rio!$I$11:$I$98,ROWS($C$10:C13)+Rio.scroll)","v":"Russia"},{"$f":"VLOOKUP($C13,Rio!$I$11:$M$98,MATCH(K$9,Rio!$I$10:$M$10,0),)","v":19},{"$f":"VLOOKUP($C13,Rio!$I$11:$M$98,MATCH(L$9,Rio!$I$10:$M$10,0),)","v":18},{"$f":"VLOOKUP($C13,Rio!$I$11:$M$98,MATCH(M$9,Rio!$I$10:$M$10,0),)","v":19},{"$f":"VLOOKUP($C13,Rio!$I$11:$M$98,MATCH(N$9,Rio!$I$10:$M$10,0),)","v":56},null,{"$f":"RANK(VLOOKUP(OVERALL!J13,London!$I$10:$M$94,2,),London!$J$10:$J$94)","v":4},{"$f":"INDEX(London!$I$10:$I$94,ROWS($J$10:J13)+london.scroll)","v":"Great Britain"},{"$f":"VLOOKUP($J13,London!$I$10:$M$94,MATCH(D$9,London!$I$9:$M$9,0),)","v":29},{"$f":"VLOOKUP($J13,London!$I$10:$M$94,MATCH(E$9,London!$I$9:$M$9,0),)","v":17},{"$f":"VLOOKUP($J13,London!$I$10:$M$94,MATCH(F$9,London!$I$9:$M$9,0),)","v":19},{"$f":"VLOOKUP($J13,London!$I$10:$M$94,MATCH(G$9,London!$I$9:$M$9,0),)","v":65}]
[null,{"$f":"RANK(VLOOKUP(C14,Rio!$I$11:$M$98,2,),Rio!$J$11:$J$98)","v":5},{"$f":"INDEX(Rio!$I$11:$I$98,ROWS($C$10:C14)+Rio.scroll)","v":"France"},{"$f":"VLOOKUP($C14,Rio!$I$11:$M$98,MATCH(K$9,Rio!$I$10:$M$10,0),)","v":10},{"$f":"VLOOKUP($C14,Rio!$I$11:$M$98,MATCH(L$9,Rio!$I$10:$M$10,0),)","v":18},{"$f":"VLOOKUP($C14,Rio!$I$11:$M$98,MATCH(M$9,Rio!$I$10:$M$10,0),)","v":14},{"$f":"VLOOKUP($C14,Rio!$I$11:$M$98,MATCH(N$9,Rio!$I$10:$M$10,0),)","v":42},null,{"$f":"RANK(VLOOKUP(OVERALL!J14,London!$I$10:$M$94,2,),London!$J$10:$J$94)","v":5},{"$f":"INDEX(London!$I$10:$I$94,ROWS($J$10:J14)+london.scroll)","v":"Germany"},{"$f":"VLOOKUP($J14,London!$I$10:$M$94,MATCH(D$9,London!$I$9:$M$9,0),)","v":11},{"$f":"VLOOKUP($J14,London!$I$10:$M$94,MATCH(E$9,London!$I$9:$M$9,0),)","v":19},{"$f":"VLOOKUP($J14,London!$I$10:$M$94,MATCH(F$9,London!$I$9:$M$9,0),)","v":14},{"$f":"VLOOKUP($J14,London!$I$10:$M$94,MATCH(G$9,London!$I$9:$M$9,0),)","v":44}]
[null,{"$f":"RANK(VLOOKUP(C15,Rio!$I$11:$M$98,2,),Rio!$J$11:$J$98)","v":5},{"$f":"INDEX(Rio!$I$11:$I$98,ROWS($C$10:C15)+Rio.scroll)","v":"Germany"},{"$f":"VLOOKUP($C15,Rio!$I$11:$M$98,MATCH(K$9,Rio!$I$10:$M$10,0),)","v":17},{"$f":"VLOOKUP($C15,Rio!$I$11:$M$98,MATCH(L$9,Rio!$I$10:$M$10,0),)","v":10},{"$f":"VLOOKUP($C15,Rio!$I$11:$M$98,MATCH(M$9,Rio!$I$10:$M$10,0),)","v":15},{"$f":"VLOOKUP($C15,Rio!$I$11:$M$98,MATCH(N$9,Rio!$I$10:$M$10,0),)","v":42},null,{"$f":"RANK(VLOOKUP(OVERALL!J15,London!$I$10:$M$94,2,),London!$J$10:$J$94)","v":6},{"$f":"INDEX(London!$I$10:$I$94,ROWS($J$10:J15)+london.scroll)","v":"Japan"},{"$f":"VLOOKUP($J15,London!$I$10:$M$94,MATCH(D$9,London!$I$9:$M$9,0),)","v":7},{"$f":"VLOOKUP($J15,London!$I$10:$M$94,MATCH(E$9,London!$I$9:$M$9,0),)","v":14},{"$f":"VLOOKUP($J15,London!$I$10:$M$94,MATCH(F$9,London!$I$9:$M$9,0),)","v":17},{"$f":"VLOOKUP($J15,London!$I$10:$M$94,MATCH(G$9,London!$I$9:$M$9,0),)","v":38}]
{"$rows_left_out":12}